Past Participle
type: Concept
description: Most likely to apply in Attributes and Properties. Example: "hand-painted"
example: "hand-painted"
in scheme: POS
notation: PP
note: Most likely to apply in Attributes and Properties
note: "hand-painted"
scope note: Most likely to apply in Attributes and Properties